{"text_format":"1","workbook":"xlsx","n_sheets":20,"sheets":["CoderSetting","Home","Sales","Customers","Sales Report","Login","template - Basic Invoice","template - Sales Invoice","template - Price List Invoice","template - Remittance Invoice","template - Parts and Labor","Deposit Invoice","template - Service Invoice","template - Service Hourly","template - Serv. Hourly op. Tax","Price List","Settings","HELP","Users","EULA"],"not_rendered":{"charts":2,"images":40,"macros":1,"external_links":1,"defined_names":155,"comments":0,"pivot_tables":0},"unopened":[],"bounds":{"document_bytes":16777216,"sheet_cells":100000,"rows_first":2000,"rows_last":500,"rows_between":2000,"halvings":0,"cell_chars":16384,"cell_head_chars":4096},"cells_cut":0,"cells_raw":0,"read":"whole","date_system":"1900"}

{"sheet":"CoderSetting","index":0,"n_rows":3,"n_cols":3,"rows_kept":3,"cut":false,"hidden":true,"merged":[]}
[]
[null,"check wether Admin exist or not",{"$f":"IF(ISERROR(MATCH(\"Admin\", Settings!H83:$H183, 0)), FALSE, TRUE)","v":false}]
[null,"Check from where user has move on Help sheet","Home"]

{"sheet":"Home","index":1,"n_rows":33,"n_cols":27,"rows_kept":33,"cut":false,"hidden":true,"merged":[[1,3,1,13],[3,3,3,13],[5,3,5,4],[14,3,14,4],[8,8,18,8],[10,10,10,13],[12,10,12,13],[16,3,16,4],[16,10,16,13],[12,3,12,4],[8,10,8,13],[18,10,18,13],[14,10,14,13],[8,3,8,4],[10,3,10,4],[18,3,18,4],[20,3,20,4],[20,8,30,8],[32,3,33,4],[32,5,35,13],[30,10,30,13],[28,3,28,4],[28,10,28,13],[26,3,26,4],[30,3,30,4],[26,10,26,13],[24,10,24,13],[22,10,22,13],[20,10,20,13],[24,3,24,4],[22,3,22,4]]}
[null,null,null,null,null,null,null,null,null,null,null,null,null,null,null,null,null,null,null,null,null,null,null,null,null,null,false]
[null,null,null,"INVOICE MANAGER PRO™"]
[null,null,null,"Support: ","support@spreadsheet123.com",null,null,null,null,null,null,null,null,null,{"$f":"\"© \"&YEAR(TODAY())&\" Spreadsheet123 LTD. All rights reserved\"","v":"© 2017 Spreadsheet123 LTD. All rights reserved"}]
[null,null,null,{"$f":"IF(ISERROR(INDEX(_paymentTermsSet,MATCH(_paymentDue,_paymentTerms,0),2)),\"\",INDEX(_paymentTermsSet,MATCH(_paymentDue,_paymentTerms,0),2))","v":""}]
[]
[null,null,null,"Welcome User",null,"Alex",null,{"$f":"IF(ISBLANK(Home!$F$6),\"\",INDEX(Sales_Rep,MATCH(Home!$F$6,Sales_Rep_Name,0),4))","v":{"$error":"#N/A"}},null,null,null,null,"Role:","Admin"]
[]
[]
[null,null,null,"Customer is",null,"Person",null,null,"Billing Address",null,{"$f":"IF(OR(ISBLANK(Home!$F$11),ISERROR(INDEX(Customers,MATCH(Home!$F$11,IF(Home!$F$9=\"Company\",Company,Person),0),IF(Home!$F$9=\"Company\",3,2)))),\"\",INDEX(Customers,MATCH(Home!$F$11,IF(Home!$F$9=\"Company\",Company,Person),0),IF(Home!$F$9=\"Company\",3,2)))","v":""}]
[]
{"$rows_left_out":24}
{"sheet":"Sales","index":2,"n_rows":11,"n_cols":23,"rows_kept":11,"cut":false,"hidden":true,"merged":[[2,0,2,14],[0,0,0,14],[1,12,1,14]]}
["INVOICE MANAGER PRO™",null,null,null,null,null,null,null,null,null,null,null,null,null,null,null,null,null,null,null,null,{"$f":"IF(NOT(W1=0),ROW(),0)","v":1},{"$f":"Settings!C66","v":"Draft"}]
[null,null,null,null,null,null,null,null,null,null,null,null,{"$f":"\"© \"&YEAR(TODAY())&\" Spreadsheet123 LTD. All rights reserved\"","v":"© 2017 Spreadsheet123 LTD. All rights reserved"},null,null,null,null,null,null,null,null,2,{"$f":"Settings!C67","v":"In Progress"}]
["SALES - OVERVIEW",null,null,null,null,null,null,null,null,null,null,null,null,null,null,null,null,null,null,null,null,3,{"$f":"Settings!C68","v":"With Balance"}]
[null,null,null,null,null,null,null,null,null,null,null,null,null,null,null,null,null,null,null,null,null,4,{"$f":"Settings!C69","v":"Paid"}]
[null,null,null,null,null,null,null,null,null,null,null,null,null,null,null,null,null,null,null,null,null,5,{"$f":"Settings!C70","v":"Closed"}]
[null,null,null,null,null,null,null,null,null,null,null,null,null,null,null,null,null,null,null,null,null,0,{"$f":"Settings!C71","v":0}]
[null,null,null,null,null,null,null,null,null,null,null,null,null,null,null,null,null,null,null,null,null,0,{"$f":"Settings!C72","v":0}]
[null,null,null,null,null,null,null,null,null,null,null,null,null,null,null,null,null,null,null,null,null,0,{"$f":"Settings!C73","v":0}]
[null,null,null,null,null,null,null,null,null,null,null,null,null,null,null,null,null,null,null,null,null,0,{"$f":"Settings!C74","v":0}]
[null,null,null,null,null,null,null,null,null,null,null,null,null,null,null,null,null,null,null,null,null,0,{"$f":"Settings!C75","v":0}]
{"$rows_left_out":2}
{"sheet":"Customers","index":3,"n_rows":7,"n_cols":12,"rows_kept":7,"cut":false,"hidden":true,"merged":[[5,0,5,11],[0,0,0,11],[1,9,1,11]]}
["INVOICE MANAGER PRO™"]
[null,null,null,null,null,null,null,null,null,{"$f":"\"© \"&YEAR(TODAY())&\" Spreadsheet123 LTD. All rights reserved\"","v":"© 2017 Spreadsheet123 LTD. All rights reserved"}]
[]
[]
[]
["CUSTOMER DATABASE"]
["ID","Name","Company Name","Address Line 1","Address Line 2","State","ZIP/Post Code","Phone","Fax","E-mail","Payment Terms","Date"]

{"sheet":"Sales Report","index":4,"n_rows":53,"n_cols":10,"rows_kept":53,"cut":false,"hidden":true,"merged":[[0,0,0,11],[4,0,4,11],[7,6,7,9],[39,0,39,4]]}
["Sales Report"]
[]
[]
[]
[]
[]
[]
[null,null,null,null,null,null,"Year To Date"]
[null,"Net Sales","Sales Tax","Total","Number of Sales","Average Net Sale","Net Sales","Number of Sales","Average Net Sales","Revenue Share"]
["January",{"$f":"SUMIF(Sales_Date,\"<=31/01\",Subtotal)","v":0},{"$f":"SUMIF(Sales_Date,\"<=31/01\",Sales_Tax)","v":0},{"$f":"SUMIF(Sales_Date,\"<=31/01\",Sales_Total)","v":0},{"$f":"SUMIF(Sales_Date,\"<=31/01\",Sales_Quantity)","v":{"$error":"#NAME?"}},{"$f":"IF(B10=0,0,B10/E10)","v":0},{"$f":"B10","v":0},{"$f":"E10","v":{"$error":"#NAME?"}},{"$f":"IF(G10=0,0,G10/H10)","v":0},{"$f":"IF(B10=0,0,B10/SUM($B$10:$B$21))","v":0}]
{"$rows_left_out":44}
{"sheet":"Login","index":5,"n_rows":0,"n_cols":0,"rows_kept":0,"cut":false,"hidden":false,"merged":[]}

{"sheet":"template - Basic Invoice","index":6,"n_rows":50,"n_cols":11,"rows_kept":50,"cut":false,"hidden":true,"merged":[[35,0,35,6],[36,0,40,6],[49,0,49,10],[46,0,46,10],[47,0,47,10],[48,0,48,10],[33,0,33,8],[33,9,33,10],[26,0,26,8],[26,9,26,10],[27,0,27,8],[27,9,27,10],[28,0,28,8],[28,9,28,10],[31,0,31,8],[31,9,31,10],[32,0,32,8],[32,9,32,10],[29,0,29,8],[29,9,29,10],[30,0,30,8],[30,9,30,10],[23,0,23,8],[23,9,23,10],[25,0,25,8],[25,9,25,10],[24,0,24,8],[24,9,24,10],[22,0,22,8],[22,9,22,10],[21,0,21,8],[21,9,21,10],[19,0,19,8],[19,9,19,10],[20,0,20,8],[20,9,20,10],[18,0,18,8],[18,9,18,10],[10,0,10,3],[10,7,10,10],[11,0,11,3],[11,7,11,10],[17,0,17,8],[17,9,17,10],[15,0,15,3],[15,7,15,10],[12,0,12,3],[12,7,12,10],[14,0,14,3],[14,7,14,10],[13,0,13,3],[13,7,13,10],[9,0,9,3],[9,7,9,10],[5,9,5,10],[0,0,0,3],[3,0,3,3],[3,9,3,10],[4,0,4,3],[4,9,4,10],[6,9,6,10],[7,9,7,10]]}
[{"$f":"_companyName","v":"Company Name"},null,null,null,null,null,null,null,null,null,"INVOICE"]
[{"$f":"_companySlogan","v":"Company Slogan"}]
[]
[null,null,null,null,null,null,null,"Date:",null,{"$f":"_invoiceDate","v":"2017-03-26"}]
[null,null,null,null,null,null,null,"Invoice #:",null,{"$f":"_newInvoice","v":1}]
[null,null,null,null,null,null,null,"Customer ID:",null,{"$f":"rngCustID","v":""}]
[null,null,null,null,null,null,null,"Purchase Order #",null,{"$f":"_purchaseOrder","v":""}]
[null,null,null,null,null,null,null,"Payment Due by:",null,{"$f":"_invoiceDueDate","v":""}]
[]
["Bill To:",null,null,null,null,null,null,"Ship To:"]
{"$rows_left_out":41}
{"sheet":"template - Sales Invoice","index":7,"n_rows":52,"n_cols":12,"rows_kept":52,"cut":false,"hidden":true,"merged":[[22,10,22,11],[14,8,14,11],[11,8,11,11],[12,8,12,11],[7,10,7,11],[13,8,13,11],[21,10,21,11],[20,10,20,11],[17,6,17,9],[17,10,17,11],[15,8,15,11],[18,10,18,11],[18,6,18,9],[22,1,22,7],[18,3,18,5],[27,10,27,11],[23,10,23,11],[26,10,26,11],[25,10,25,11],[24,10,24,11],[3,10,3,11],[4,10,4,11],[5,10,5,11],[13,0,13,3],[3,8,3,9],[4,8,4,9],[3,0,3,2],[11,0,11,3],[10,0,10,3],[5,8,5,9],[6,10,6,11],[6,8,6,9],[7,8,7,9],[10,8,10,11],[9,8,9,11],[0,0,0,3],[29,1,29,7],[23,1,23,7],[21,1,21,7],[25,1,25,7],[4,0,4,2],[12,0,12,3],[9,0,9,3],[14,0,14,3],[15,0,15,3],[17,0,17,2],[18,0,18,2],[26,1,26,7],[27,1,27,7],[17,3,17,5],[20,1,20,7],[24,1,24,7],[40,14,40,17],[39,14,39,17],[35,1,35,7],[35,10,35,11],[36,10,36,11],[38,0,38,7],[36,1,36,7],[31,1,31,7],[33,1,33,7],[29,10,29,11],[30,10,30,11],[31,10,31,11],[28,1,28,7],[30,1,30,7],[28,10,28,11],[51,0,51,11],[49,0,49,11],[50,0,50,11],[39,0,43,7],[32,1,32,7],[34,10,34,11],[34,1,34,7],[33,10,33,11],[32,10,32,11]]}
[{"$f":"_companyName","v":"Company Name"},null,null,null,null,null,null,null,null,null,null,"INVOICE"]
[{"$f":"_companySlogan","v":"Company Slogan"}]
[]
[null,null,null,null,null,null,null,null,"Date:",null,{"$f":"_invoiceDate","v":"2017-03-26"}]
[null,null,null,null,null,null,null,null,"Invoice #:",null,{"$f":"_newInvoice","v":1}]
[null,null,null,null,null,null,null,null,"Customer ID:",null,{"$f":"rngCustID","v":""}]
[null,null,null,null,null,null,null,null,"Purchase Order #",null,{"$f":"_purchaseOrder","v":""}]
[null,null,null,null,null,null,null,null,"Payment Due by:",null,{"$f":"_invoiceDueDate","v":""}]
[]
["Bill To:",null,null,null,null,null,null,null,"Ship To:"]
{"$rows_left_out":43}
{"sheet":"template - Price List Invoice","index":8,"n_rows":52,"n_cols":12,"rows_kept":52,"cut":false,"hidden":true,"merged":[[4,0,4,2],[4,8,4,9],[4,10,4,11],[0,0,0,3],[3,0,3,2],[3,8,3,9],[3,10,3,11],[14,0,14,3],[14,8,14,11],[9,0,9,3],[9,8,9,11],[10,0,10,3],[10,8,10,11],[11,0,11,3],[11,8,11,11],[12,0,12,3],[12,8,12,11],[13,0,13,3],[13,8,13,11],[5,10,5,11],[6,8,6,9],[6,10,6,11],[7,8,7,9],[7,10,7,11],[5,8,5,9],[15,0,15,3],[15,8,15,11],[17,0,17,2],[17,3,17,5],[17,6,17,9],[17,10,17,11],[18,6,18,9],[18,10,18,11],[26,1,26,7],[26,10,26,11],[21,1,21,7],[21,10,21,11],[23,1,23,7],[23,10,23,11],[22,1,22,7],[22,10,22,11],[20,1,20,7],[20,10,20,11],[18,0,18,2],[18,3,18,5],[36,1,36,7],[36,10,36,11],[35,1,35,7],[30,1,30,7],[30,10,30,11],[31,10,31,11],[32,1,32,7],[32,10,32,11],[29,1,29,7],[29,10,29,11],[24,1,24,7],[24,10,24,11],[35,10,35,11],[27,1,27,7],[27,10,27,11],[25,1,25,7],[25,10,25,11],[28,1,28,7],[28,10,28,11],[34,1,34,7],[34,10,34,11],[33,1,33,7],[33,10,33,11],[31,1,31,7],[40,15,40,18],[38,0,38,7],[39,15,39,18],[51,0,51,11],[39,0,43,7],[50,0,50,11],[49,0,49,11]]}
[{"$f":"_companyName","v":"Company Name"},null,null,null,null,null,null,null,null,null,null,"INVOICE"]
[{"$f":"_companySlogan","v":"Company Slogan"}]
[]
[null,null,null,null,null,null,null,null,"Date:",null,{"$f":"_invoiceDate","v":"2017-03-26"}]
[null,null,null,null,null,null,null,null,"Invoice #:",null,{"$f":"_newInvoice","v":1}]
[null,null,null,null,null,null,null,null,"Customer ID:",null,{"$f":"rngCustID","v":""}]
[null,null,null,null,null,null,null,null,"Purchase Order #",null,{"$f":"_purchaseOrder","v":""}]
[null,null,null,null,null,null,null,null,"Payment Due by:",null,{"$f":"_invoiceDueDate","v":""}]
[]
["Bill To:",null,null,null,null,null,null,null,"Ship To:"]
{"$rows_left_out":43}
{"sheet":"template - Remittance Invoice","index":9,"n_rows":63,"n_cols":12,"rows_kept":63,"cut":false,"hidden":true,"merged":[[47,0,47,11],[62,0,62,11],[50,0,50,11],[55,2,55,4],[55,10,55,11],[61,0,61,11],[48,0,48,11],[34,0,34,7],[35,0,39,7],[45,0,45,11],[25,1,25,7],[25,10,25,11],[26,1,26,7],[26,10,26,11],[29,1,29,7],[29,10,29,11],[27,1,27,7],[30,1,30,7],[30,10,30,11],[32,1,32,7],[32,10,32,11],[31,1,31,7],[31,10,31,11],[27,10,27,11],[15,0,15,3],[28,1,28,7],[28,10,28,11],[23,1,23,7],[23,10,23,11],[21,1,21,7],[24,1,24,7],[24,10,24,11],[21,10,21,11],[22,1,22,7],[17,6,17,9],[20,1,20,7],[20,10,20,11],[22,10,22,11],[17,10,17,11],[18,10,18,11],[18,0,18,2],[18,3,18,5],[18,6,18,9],[17,0,17,2],[17,3,17,5],[15,8,15,11],[12,0,12,3],[12,8,12,11],[13,0,13,3],[13,8,13,11],[14,0,14,3],[9,0,9,3],[9,8,9,11],[14,8,14,11],[5,10,5,11],[6,10,6,11],[10,0,10,3],[10,8,10,11],[11,0,11,3],[11,8,11,11],[3,0,3,3],[3,10,3,11],[4,0,4,3],[4,10,4,11],[7,10,7,11]]}
[{"$f":"_companyName","v":"Company Name"},null,null,null,null,null,null,null,null,null,null,"INVOICE"]
[{"$f":"_companySlogan","v":"Company Slogan"}]
[]
[null,null,null,null,null,null,null,null,"Date:",null,{"$f":"_invoiceDate","v":"2017-03-26"}]
[null,null,null,null,null,null,null,null,"Invoice #:",null,{"$f":"_newInvoice","v":1}]
[null,null,null,null,null,null,null,null,"Customer ID:",null,{"$f":"rngCustID","v":""}]
[null,null,null,null,null,null,null,null,"Purchase Order #",null,{"$f":"_purchaseOrder","v":""}]
[null,null,null,null,null,null,null,null,"Payment Due by:",null,{"$f":"_invoiceDueDate","v":""}]
[]
["Bill To:",null,null,null,null,null,null,null,"Ship To:"]
{"$rows_left_out":54}
{"sheet":"template - Parts and Labor","index":10,"n_rows":52,"n_cols":12,"rows_kept":52,"cut":false,"hidden":true,"merged":[[15,8,15,11],[0,0,0,3],[3,0,3,2],[3,8,3,9],[11,0,11,3],[11,8,11,11],[4,10,4,11],[3,10,3,11],[4,0,4,2],[4,8,4,9],[5,10,5,11],[9,0,9,3],[9,8,9,11],[5,8,5,9],[6,8,6,9],[6,10,6,11],[18,10,18,11],[12,0,12,3],[12,8,12,11],[19,10,19,11],[7,10,7,11],[18,0,18,6],[10,0,10,3],[14,0,14,3],[14,8,14,11],[17,0,17,6],[15,0,15,3],[13,0,13,3],[17,10,17,11],[13,8,13,11],[7,8,7,9],[10,8,10,11],[23,10,23,11],[25,0,25,6],[24,10,24,11],[25,10,25,11],[20,0,20,6],[20,10,20,11],[32,10,32,11],[31,0,31,6],[32,0,32,6],[27,0,27,6],[19,0,19,6],[28,10,28,11],[28,0,28,6],[26,10,26,11],[27,10,27,11],[22,0,22,6],[22,10,22,11],[23,0,23,6],[24,0,24,6],[26,0,26,6],[21,0,21,6],[21,10,21,11],[29,10,29,11],[30,10,30,11],[29,0,29,6],[30,0,30,6],[31,10,31,11],[49,0,49,11],[37,0,37,7],[50,0,50,11],[51,0,51,11],[38,0,43,7],[38,14,38,17],[39,14,39,17],[33,10,33,11],[35,0,35,6],[35,10,35,11],[34,10,34,11],[33,0,33,6],[34,0,34,6]]}
[{"$f":"_companyName","v":"Company Name"},null,null,null,null,null,null,null,null,null,null,"INVOICE"]
[{"$f":"_companySlogan","v":"Company Slogan"}]
[]
[null,null,null,null,null,null,null,null,"Date:",null,{"$f":"_invoiceDate","v":"2017-03-26"}]
[null,null,null,null,null,null,null,null,"Invoice #:",null,{"$f":"_newInvoice","v":1}]
[null,null,null,null,null,null,null,null,"Customer ID:",null,{"$f":"rngCustID","v":""}]
[null,null,null,null,null,null,null,null,"Purchase Order #",null,{"$f":"_purchaseOrder","v":""}]
[null,null,null,null,null,null,null,null,"Payment Due by:",null,{"$f":"_invoiceDueDate","v":""}]
[]
["Bill To:",null,null,null,null,null,null,null,"Ship To:"]
{"$rows_left_out":43}
{"sheet":"Deposit Invoice","index":11,"n_rows":65,"n_cols":11,"rows_kept":65,"cut":false,"hidden":true,"merged":[[45,1,45,6],[38,1,38,6],[35,1,35,6],[44,1,44,6],[34,1,34,6],[43,1,43,6],[42,1,42,6],[36,1,36,6],[47,1,47,6],[48,1,48,6],[64,0,64,8],[54,3,54,4],[58,0,58,8],[60,0,60,8],[62,0,62,8],[63,0,63,8],[18,0,18,2],[21,7,21,8],[53,3,53,4],[25,1,25,6],[39,1,39,6],[28,1,28,6],[29,1,29,6],[46,1,46,6],[40,1,40,6],[41,1,41,6],[37,1,37,6],[50,1,50,6],[31,1,31,6],[30,1,30,6],[49,1,49,6],[33,1,33,6],[21,2,21,3],[32,1,32,6],[22,7,22,8],[26,1,26,6],[27,1,27,6],[24,1,24,6],[22,0,22,1],[22,4,22,6],[22,2,22,3],[17,0,17,2],[21,4,21,6],[7,0,7,3],[9,0,9,2],[10,0,10,2],[12,0,12,2],[14,0,14,2],[14,6,14,7],[13,0,13,2],[13,6,13,7],[16,0,16,2],[16,6,16,7],[15,0,15,2],[15,6,15,7],[18,6,18,7],[21,0,21,1]]}
[]
[]
[]
[]
[]
[]
[]
["Your Logo Here",null,null,null,null,null,null,null,"Invoice"]
[null,null,null,null,null,null,null,null,null,null,"Customer is:"]
[{"$f":"IF(ISBLANK(Settings!C5),\"\",Settings!C5)","v":"Company Name"},null,null,null,null,null,null,"Date:",{"$f":"IF(ISBLANK(L13),TODAY(),L13)","v":"2017-03-26"}]
{"$rows_left_out":56}
{"sheet":"template - Service Invoice","index":12,"n_rows":50,"n_cols":11,"rows_kept":50,"cut":false,"hidden":true,"merged":[[9,0,9,3],[9,7,9,10],[5,9,5,10],[0,0,0,3],[3,0,3,3],[3,9,3,10],[4,0,4,3],[4,9,4,10],[6,9,6,10],[7,9,7,10],[18,0,18,8],[18,9,18,10],[10,0,10,3],[10,7,10,10],[11,0,11,3],[11,7,11,10],[17,0,17,8],[17,9,17,10],[15,0,15,3],[15,7,15,10],[12,0,12,3],[12,7,12,10],[14,0,14,3],[14,7,14,10],[13,0,13,3],[13,7,13,10],[19,0,19,8],[19,9,19,10],[20,0,20,8],[20,9,20,10],[22,0,22,8],[22,9,22,10],[21,0,21,8],[21,9,21,10],[23,0,23,8],[23,9,23,10],[25,0,25,8],[25,9,25,10],[24,0,24,8],[24,9,24,10],[33,0,33,8],[33,9,33,10],[26,0,26,8],[26,9,26,10],[27,0,27,8],[27,9,27,10],[28,0,28,8],[28,9,28,10],[31,0,31,8],[31,9,31,10],[32,0,32,8],[32,9,32,10],[29,0,29,8],[29,9,29,10],[30,0,30,8],[30,9,30,10],[35,0,35,6],[36,0,40,6],[49,0,49,10],[46,0,46,10],[47,0,47,10],[48,0,48,10],[10,15,10,18],[4,15,4,18],[5,15,5,18],[6,15,6,18],[7,15,7,18],[8,15,8,18],[9,15,9,18]]}
[{"$f":"_companyName","v":"Company Name"},null,null,null,null,null,null,null,null,null,"INVOICE"]
[{"$f":"_companySlogan","v":"Company Slogan"}]
[]
[null,null,null,null,null,null,null,"Date:",null,{"$f":"_invoiceDate","v":"2017-03-26"}]
[null,null,null,null,null,null,null,"Invoice #:",null,{"$f":"_newInvoice","v":1}]
[null,null,null,null,null,null,null,"Customer ID:",null,{"$f":"rngCustID","v":""}]
[null,null,null,null,null,null,null,"Work Order #",null,{"$f":"_purchaseOrder","v":""}]
[null,null,null,null,null,null,null,"Payment Due by:",null,{"$f":"_invoiceDueDate","v":""}]
[]
["Bill To:"]
{"$rows_left_out":41}
{"sheet":"template - Service Hourly","index":13,"n_rows":51,"n_cols":12,"rows_kept":51,"cut":false,"hidden":true,"merged":[[50,0,50,11],[48,0,48,11],[49,0,49,11],[38,0,42,7],[33,0,33,7],[34,0,34,7],[37,0,37,7],[35,0,35,7],[33,10,33,11],[39,14,39,17],[38,14,38,17],[34,10,34,11],[35,10,35,11],[0,0,0,3],[4,0,4,2],[12,0,12,3],[9,0,9,3],[10,0,10,3],[10,8,10,11],[28,10,28,11],[29,10,29,11],[32,10,32,11],[31,10,31,11],[30,10,30,11],[28,0,28,7],[3,0,3,2],[11,0,11,3],[13,8,13,11],[5,8,5,9],[9,8,9,11],[12,8,12,11],[6,10,6,11],[6,8,6,9],[7,10,7,11],[3,10,3,11],[4,10,4,11],[5,10,5,11],[11,8,11,11],[3,8,3,9],[4,8,4,9],[27,10,27,11],[26,10,26,11],[20,10,20,11],[25,10,25,11],[24,10,24,11],[22,10,22,11],[23,10,23,11],[21,10,21,11],[17,0,17,7],[13,0,13,3],[23,0,23,7],[7,8,7,9],[14,0,14,3],[15,0,15,3],[15,8,15,11],[18,10,18,11],[17,10,17,11],[19,10,19,11],[14,8,14,11],[30,0,30,7],[31,0,31,7],[32,0,32,7],[18,0,18,7],[19,0,19,7],[20,0,20,7],[21,0,21,7],[27,0,27,7],[26,0,26,7],[22,0,22,7],[24,0,24,7],[25,0,25,7],[29,0,29,7]]}
[{"$f":"_companyName","v":"Company Name"},null,null,null,null,null,null,null,null,null,null,"INVOICE"]
[{"$f":"_companySlogan","v":"Company Slogan"}]
[]
[null,null,null,null,null,null,null,null,"Date:",null,{"$f":"_invoiceDate","v":"2017-03-26"}]
[null,null,null,null,null,null,null,null,"Invoice #:",null,{"$f":"_newInvoice","v":1}]
[null,null,null,null,null,null,null,null,"Customer ID:",null,{"$f":"rngCustID","v":""}]
[null,null,null,null,null,null,null,null,"Purchase Order #",null,{"$f":"_purchaseOrder","v":""}]
[null,null,null,null,null,null,null,null,"Payment Due by:",null,{"$f":"_invoiceDueDate","v":""}]
[]
["Bill To:"]
{"$rows_left_out":42}
{"sheet":"template - Serv. Hourly op. Tax","index":14,"n_rows":51,"n_cols":12,"rows_kept":51,"cut":false,"hidden":true,"merged":[[29,0,29,6],[30,0,30,6],[31,0,31,6],[32,0,32,6],[20,0,20,6],[21,0,21,6],[27,0,27,6],[28,0,28,6],[22,0,22,6],[23,0,23,6],[7,10,7,11],[6,10,6,11],[6,7,6,8],[7,7,7,8],[26,0,26,6],[24,0,24,6],[25,0,25,6],[14,0,14,3],[15,0,15,3],[18,0,18,6],[19,0,19,6],[10,7,10,11],[18,10,18,11],[17,10,17,11],[19,10,19,11],[27,10,27,11],[26,10,26,11],[20,10,20,11],[23,10,23,11],[22,10,22,11],[24,10,24,11],[25,10,25,11],[21,10,21,11],[3,10,3,11],[4,10,4,11],[5,10,5,11],[17,0,17,6],[13,0,13,3],[3,7,3,8],[4,7,4,8],[3,0,3,2],[11,0,11,3],[13,7,13,11],[5,7,5,8],[9,7,9,11],[15,7,15,11],[14,7,14,11],[11,7,11,11],[12,7,12,11],[0,0,0,3],[4,0,4,2],[12,0,12,3],[9,0,9,3],[10,0,10,3],[39,14,39,17],[38,14,38,17],[34,10,34,11],[35,10,35,11],[37,0,37,6],[35,0,35,6],[33,10,33,11],[50,0,50,11],[48,0,48,11],[49,0,49,11],[38,0,42,6],[33,0,33,6],[34,0,34,6],[28,10,28,11],[29,10,29,11],[32,10,32,11],[31,10,31,11],[30,10,30,11]]}
[{"$f":"_companyName","v":"Company Name"},null,null,null,null,null,null,null,null,null,null,"INVOICE"]
[{"$f":"_companySlogan","v":"Company Slogan"}]
[]
[null,null,null,null,null,null,null,"Date:",null,null,{"$f":"_invoiceDate","v":"2017-03-26"}]
[null,null,null,null,null,null,null,"Invoice #:",null,null,{"$f":"_newInvoice","v":1}]
[null,null,null,null,null,null,null,"Customer ID:",null,null,{"$f":"rngCustID","v":""}]
[null,null,null,null,null,null,null,"Purchase Order #",null,null,{"$f":"_purchaseOrder","v":""}]
[null,null,null,null,null,null,null,"Payment Due by:",null,null,{"$f":"_invoiceDueDate","v":""}]
[]
["Bill To:"]
{"$rows_left_out":42}
{"sheet":"Price List","index":15,"n_rows":23,"n_cols":3,"rows_kept":23,"cut":false,"hidden":true,"merged":[[0,0,0,2]]}
["Price List"]
[]
["Catalog #","Description","Unit Price"]
["A223311","Product 1",5]
["11Z2233","Product 2",7]
[331122,"Product 3",1.85]
[332211,"Product 4",2.25]
[112233,"Product 5",9]
[113322,"Product 6",5.6]
[221133,"Product 7",5.7]
{"$rows_left_out":14}
{"sheet":"Settings","index":16,"n_rows":81,"n_cols":9,"rows_kept":81,"cut":false,"hidden":true,"merged":[[2,0,2,6],[7,0,7,6],[31,1,31,5],[36,1,36,5],[21,0,21,6],[27,0,27,6],[6,1,6,4],[5,2,5,3],[4,2,4,3],[9,2,9,3],[10,2,10,3],[11,2,11,3],[12,2,12,3],[17,2,17,3],[12,4,12,5],[13,2,13,3],[76,0,76,6],[80,4,80,5],[80,0,80,1],[19,2,19,3],[39,2,39,3],[38,2,38,3],[13,4,13,5],[18,2,18,3],[16,2,16,3],[87,4,87,5],[46,0,46,6],[63,0,63,6],[86,4,86,5],[40,2,40,3],[85,4,85,5],[50,0,50,6],[42,0,42,6],[44,2,44,3],[84,4,84,5],[83,4,83,5],[14,2,14,3],[82,4,82,5]]}
[null,"Settings"]
[]
["Company Information"]
[]
[null,"Company Name","Company Name",null,null,"Enable"]
[null,"Company Slogan (Optional)","Company Slogan",null,null,"Enable"]
[]
["Company Address"]
[]
[null,"Building/House Number",111]
{"$rows_left_out":72}
{"sheet":"HELP","index":17,"n_rows":330,"n_cols":8,"rows_kept":330,"cut":false,"hidden":true,"merged":[[287,0,287,10],[172,0,172,10],[316,2,316,7],[325,3,325,4],[236,0,236,10],[253,0,253,10],[280,0,280,10],[320,1,320,2],[324,1,324,2],[299,3,299,7],[143,0,143,10],[82,0,82,10],[24,0,24,10],[26,0,26,10],[328,3,328,4],[55,0,55,10],[98,0,98,10],[105,0,105,10],[127,0,127,10],[58,0,58,10],[27,0,27,10],[112,0,112,10],[184,0,184,10],[158,0,158,10],[296,2,296,7],[301,2,301,7],[329,3,329,4],[327,1,327,2],[328,1,328,2],[318,7,329,9],[329,1,329,2],[324,3,324,4],[327,3,327,4],[325,1,325,2],[326,1,326,2],[326,3,326,4],[2,1,2,9],[3,1,3,9],[19,0,19,10],[21,0,21,10],[22,0,22,10],[4,2,4,9],[5,2,5,9],[6,2,6,9],[7,2,7,9],[8,2,8,9],[9,2,9,9],[10,2,10,9],[11,1,11,9],[12,1,12,9],[13,1,13,9]]}
["Invoice Manager Pro V-1.0.0 - HELP"]
[]
[null,"1. How to begin using Invoice Manager Pro V-1.0.0 for the first time"]
[null,"2. General settings, what can I change?"]
[null,2.1,"Company Information and Country Specific Settings"]
[null,2.2000000000000002,"Invoice Archive Directory"]
[null,2.2999999999999998,"Customer ID Settings"]
[null,2.4,"Payment Terms"]
[null,2.5,"Invoice Status"]
[null,2.6,"Admin/User Login Credentials"]
{"$rows_left_out":321}
{"sheet":"Users","index":18,"n_rows":3,"n_cols":7,"rows_kept":3,"cut":false,"hidden":true,"merged":[]}
["Username","Password","Name","Position","Phone Ext.","Role"]
["AlekoB77","Datuna77","David","Sales Manager","1111","admin",{"$f":"INDEX(_system_log,MATCH(Home!#REF!,_userName,0),2)=Home!#REF!","v":{"$error":"#REF!"}}]
["NinukaB77","alekob77",null,null,null,"user"]

{"sheet":"EULA","index":19,"n_rows":0,"n_cols":0,"rows_kept":0,"cut":false,"hidden":true,"merged":[]}